Welcome to the forums. Please post in English or French.

You are not logged in.

#1 2019-01-07 16:13:01

etaked
Member
Registered: 2019-01-07
Posts: 1

Mumps installation problem -> undefined reference to `metis_nodewnd_'

anshul@anshul-HP-Pavilion-Notebook:~/MUMPS_4.9.2$ make
make ARITH=d mumps_lib
make[1]: Entering directory '/home/anshul/MUMPS_4.9.2'
(cd src ; make d)
make[2]: Entering directory '/home/anshul/MUMPS_4.9.2/src'
make ARITH=d mumps_lib
make[3]: Entering directory '/home/anshul/MUMPS_4.9.2/src'
make[3]: Nothing to be done for 'mumps_lib'.
make[3]: Leaving directory '/home/anshul/MUMPS_4.9.2/src'
make[2]: Leaving directory '/home/anshul/MUMPS_4.9.2/src'
make[1]: Leaving directory '/home/anshul/MUMPS_4.9.2'
(cd examples ; make d)
make[1]: Entering directory '/home/anshul/MUMPS_4.9.2/examples'
mpif90 -o dsimpletest -O dsimpletest.o ../lib/libdmumps.a ../lib/libmumps_common.a  /home/anshul/metis-5.1.0/build/Linux-x86_64/libmetis/libmetis.a -L../PORD/lib/ -lpord -L/home/anshul/scotch_6.0.6/lib -lesmumps -lscotch -lscotcherr /usr/local/lib/libscalapack.a /opt/OpenBLAS/lib/libopenblas.a  -L/usr/lib -lmpi /usr/local/lib/libblas.a -lpthread
/usr/bin/ld: warning: libmpi.so.40, needed by /usr/local/openmpi/lib/libmpi_mpifh.so, may conflict with libmpi.so.20
../lib/libdmumps.a(dmumps_part2.o): In function `dmumps_195_':
dmumps_part2.F:(.text+0x1965a): undefined reference to `metis_nodewnd_'
collect2: error: ld returned 1 exit status
Makefile:34: recipe for target 'dsimpletest' failed
make[1]: *** [dsimpletest] Error 1
make[1]: Leaving directory '/home/anshul/MUMPS_4.9.2/examples'
Makefile:45: recipe for target 'dexamples' failed
make: *** [dexamples] Error 2
anshul@anshul-HP-Pavilion-Notebook:~/MUMPS_4.9.2$

I'm having a hard time getting the makefile work, I think I've installed all prerequisite libraries, still some problem is there which I cannot get around. Any insight is appreciated. Thank you.

Offline

Board footer